Xcode exit code 1 error

Apple Mach- O Linker Error - Linker command failed with exit code 1. Apple Mach- O Linker Error - Linker command. I had this error when Xcode found two. swift files with same name. Rename one of them and build again. xcode build error: swiftc failed with exit code 1. 报错12个: Ld / Users/ muzi/ Library/ Developer/ Xcode/ DerivedData/ Test- dgoxexrhktbbjyhfntwybbjmdrib/ Build. error: linker command failed with exit code 1. · Hello I was building a timer app and when I compile I got this error: clang error: Linker command failed with exit code 1 And here are the links to. · There is this error I get when I try and build for iOS 9 using XCode 7 and Unity 5. [ xcode] clang: error: linker command failed with exit code 1.

  • Error code 0221 interval timer alienware
  • Roku wont connect error code 014
  • Cox error code 3 1 2
  • P0133 error code honda
  • Hp t1100 error code 79 04


  • Video:Code error xcode

    Code error exit

    How to fix - Command / usr/ bin/ codesign failed with exit code 1 with Xcode 8. App to Find Duplicate Photos in Mac OS. duplicate output file error in XCode 10. Linker command filed with exit code 1. Ahora ya conoces una manera fácil de quitarte la benda de los ojos y conocer el verdadero error que Xcode no te quiso. 1) で、 アプリを作っているのですが、 アニメーションに使おうとcocoapodsでpop. clang: error: linker command failed with exit code 1」 というエラーへの対処. xcodeで書出しを行った際に. clang: error: linker command. · Participate in discussions with other Treehouse. linker command failed with exit code 1.

    com/ questions/ / xcode- 5- 1. · I' ve just updated to latest XCode Version 7. clang: error: linker command failed with exit code 1 ( use - v to see invocation). I got error when I try make archive in xcode clang: error: linker command failed with exit code 1 ( use - v to see invocation) what is the problem? · しなおして( 不要だったかも) 、 projectname. からXcodeを開いたところ、 ビルドしてもエラーが出なくなった。. linker command failed with exit code 1 when adding IBMBluemix. framework to Xcode. Question by Frank_ Mielke. Xcodeで実機ビルドをしたタイミングで、 下記のエラーが発生した。 Showing All Messages clang: error: linker command failed with exit code 1. CodeSign " / Users/ michaellindahl/ Library/ Developer/ Xcode/ DerivedData/ Fraction_ Calculator- cgirhuuvywfnsyenisucsuauquoz/ Build/ Products/ Debug- iphoneos/ Fraction Calculator. Xcodeでこんなエラーが。 Apple Mach- O Linker ( ld) Error Linker command failed with exit code 1 ( use - v to see invocation. command failed with exit code 1 ( use - v to see invocation. · ly/ oQ5qKo Tips for solving the xcode codesign failed with exit code 1 certificate error.

    How to find the ambiguous certificate that is causing. · This article describes possible solutions for the error: Failed to execute dylibcodesign with exit code: 1. Questions: I recently upgraded to the latest Xcode and after adding a bunch of new code and fixing all my normal compile errors I got the following and I’ m not sure. 1로 업그레이드 하고 나서 약간의 문제가. 1, error, Framework, link error, Linker command failed with exit code 1, Xcode. folder xcode; » [ xcode] Archiveすると「 clang: error: linker command failed with exit code 1 ( use - vto see invocation). 6 builds fail on Xcode - linker command failed with exit code 1 # 236. I get not just this 1 error,. Method 1: Xcode Deploys Non- VR,. · I am working on Xcode 8. 1 Below is the linker error trace which i get,. Linker command failed with exit code 1. · clang: error: linker command failed with exit code 1 ( use - v to see invocation) This helped me ; Actions. or at least Xcode thinks you do.

    Unity is the ultimate game development platform. Use Unity to build high- quality 3D and 2D games, deploy them across mobile, desktop, VR/ AR, consoles or the Web, and. XCode: ' Exit code 1' during runtime. were reporting the error was happening during XCode building, XCode linking, or as soon as the game started on the device. Unity→ iOSビルド プロジェクトファイルをXcodeにてビルド " linker command failed with exit code 1 unity" すると最後にこのエラー!. Доброго времени суток. У меня случилась такая неприятность: я разбирался в своем. CodeSign / Users/ admin/ Library/ Developer/ Xcode. errSecInternalComponent Command / usr/ bin/ codesign failed with exit code 1. Finished with error - code:. · linker command failed with exit code 1.

    Xcode 编译常见错误. Showing All Issues clang: error: linker command failed with exit code 1 ( use - v to. · Hello please help me with this problem, hope you can and maybe record video response. Command / usr/ bin/ codesign failed with exit code 1. · 解决XCode编译错误clang: error: linker command failed with exit code 1 今天把XCode4. 1升级为XCode4. 1, 然后调试接了一台iPhone4, 一. This is the error thrown when I click run on Xcode: Ld / Users/ alexcons/ Library/ Developer/ Xcode/ DerivedData/ godot_ ios- gnjwoajxqwtoakhauncnzsknykel/ Build/ Products/ Debug. Error内容 Apple Mach- O( ld) Error Group Linker command failed with exit code 1 ( use - v to see invocation) 解決方法 ビルド設定の" Other Linker Flags" から. iOS] [ Cardboard] Xcode throws linker error when VR SDK is set to. we can’ t seem to be past the “ linker command failed with exit code 1” error. Xcode 빌드 시 error: linker command failed with exit code 1 에러 초반엔 프레임워크 링크가 깨진건가 했는데, 에러 메시지 바로 위에. · Participate in discussions with other Treehouse members and learn. Apple Mach- O Linker Error: Xcode 6. · 【 Xcode】 【 iOS】 ライブラリ導入時のApple Mach- O Linker Error.

    library not found for - lcurl.